{"text_format":"1","workbook":"xlsx","n_sheets":19,"sheets":["Home Page","Welcome","Preamble and Tender","General Information","Full Job Descriptions Standard","Full Job Desc Ship Specific","Cost Comparison","Selected Shipyard","Additional Jobs","Project Costs","Cost of Services","Off-hire Bunkers","Specific Cost","Sign Off","Accounts Summary","SAP DL","General Instructions","VesselNameCode","Job Desc Data Source"],"not_rendered":{"charts":0,"images":12,"macros":1,"external_links":0,"defined_names":95,"comments":8,"pivot_tables":0},"unopened":[],"bounds":{"document_bytes":16777216,"sheet_cells":100000,"rows_first":2000,"rows_last":500,"rows_between":2000,"halvings":0,"cell_chars":16384,"cell_head_chars":4096},"cells_cut":0,"cells_raw":0,"read":"whole","date_system":"1900"}

{"sheet":"Home Page","index":0,"n_rows":29,"n_cols":12,"rows_kept":29,"cut":false,"hidden":true,"merged":[[48,5,48,10],[43,5,43,10],[44,5,44,10],[45,5,45,10],[46,5,46,10],[47,5,47,10],[39,5,39,10],[40,5,40,10],[41,5,41,10],[42,5,42,10],[38,4,38,10],[34,4,34,10],[32,4,32,10],[35,4,35,10],[36,4,36,10],[37,4,37,10],[29,4,29,10],[28,4,28,10],[30,4,30,10],[31,4,31,10],[33,4,33,10],[1,6,1,7],[7,1,7,3],[14,1,14,3],[16,1,16,3],[10,1,10,3],[8,4,9,10],[4,6,5,6],[32,2,34,2],[9,1,9,3],[12,1,12,3],[22,1,22,3],[29,1,29,3],[30,1,30,3],[28,1,28,3],[18,1,18,3],[20,1,20,3],[24,1,24,3],[26,1,26,3],[27,1,27,3]]}
[]
[]
[null,null,null,null,null,null,null,{"$f":"_xlfn.CONCAT(\"Version\",\" \",H5,\" \",\"-\",\" \",TEXT(H4,\"dd-mmm-yyyy\"))","v":"Version 3.0 - 28-Mar-2022"}]
[null,null,null,null,null,null,null,"2022-03-28"]
[null,null,null,null,null,null,null,"3.0"]
[]
{"$rows_left_out":24}
{"sheet":"Welcome","index":1,"n_rows":6,"n_cols":4,"rows_kept":6,"cut":false,"hidden":false,"merged":[[32,1,34,1],[18,0,18,2],[20,0,20,2],[22,0,22,2],[24,0,24,2],[26,0,26,2],[27,0,27,2],[5,3,5,11],[0,3,4,11],[28,0,28,2],[29,0,29,2],[30,0,30,2],[9,0,9,2],[10,0,10,2],[12,0,12,2],[14,0,14,2],[16,0,16,2]]}
[null,null,null,"Welcome to Grindrod Shipping Drydock Workbook. In order to use this workbook, click 'Enable Content' on the Message Bar. Alternatively, open this workbook from a Trusted Location.\n"]
[]
[]
[]
[]
[null,null,null,"Excel workbook with macro-enabled does not support open in a browser window. You have to open this workbook in Desktop App."]
{"$rows_left_out":1}
{"sheet":"Preamble and Tender","index":2,"n_rows":192,"n_cols":7,"rows_kept":192,"cut":false,"hidden":true,"merged":[[27,1,27,3],[7,1,7,3],[14,1,14,3],[16,1,16,3],[12,1,12,3],[17,1,17,3],[18,1,18,3],[20,1,20,3],[24,1,24,3],[26,1,26,3],[22,1,22,3],[29,1,29,3],[38,1,38,3],[28,1,28,3],[99,1,99,3],[145,1,145,3],[32,2,34,2],[37,1,37,3],[41,1,41,3],[39,1,39,3],[35,1,35,3],[191,1,191,3],[30,1,30,3],[79,1,79,3],[53,1,53,3],[47,1,47,3],[59,1,59,3],[71,1,71,3],[77,1,77,3],[31,1,31,3],[43,1,43,3],[40,1,40,3],[36,1,36,3]]}
[]
[]
[null,null,null,null,null,null,"PREAMBLE OF SPECIFICATIONS"]
[]
[null,null,null,null,null,1,"The term “OWNER” as used in the preamble specifications shall be deemed to mean “GRINDROD SHIPMANAGEMENT PTE LTD”. The term \"CONTRACTOR”, “YARD” and “SHIPYARD” are to be interpreted to mean the prime contractor to whom the invitation to bid is directed. The term “SUBCONTRACTOR” as used herein shall be understood to mean any firm other than the contractor engaged to perform any service to the subject vessel whether hired by the contractor or the owner."]
[null,null,null,null,null,2,"Tenders are to be addressed and delivered to:\nGrindrod Ship Management, a Division of Grindrod Shipping Pte. Ltd\n200 Cantonment Road, #03-01. Southpoint, Singapore, 089763\nOffice +65 66320048/ Fax\nEmail: technical@grindrodshipman.com\nNot later than .......\t"]
{"$rows_left_out":187}
{"sheet":"General Information","index":3,"n_rows":185,"n_cols":107,"rows_kept":185,"cut":false,"hidden":true,"merged":[[30,91,31,91],[32,91,33,91],[1,1,1,3],[30,83,31,83],[29,79,33,79],[30,73,31,73],[30,75,31,75],[30,69,31,69],[30,71,31,71],[34,1,35,3],[40,1,40,3],[36,1,36,3],[55,41,57,41],[73,41,75,41],[52,41,54,41],[76,41,78,41],[79,41,81,41],[58,41,60,41],[61,41,63,41],[64,41,66,41],[67,41,69,41],[70,41,72,41]]}
[]
[null,"Back to top"]
[null,null,null,null,null,"GENERAL SHIP INFORMATION",null,null,null,"GENERAL SHIP INFORMATION",null,null,null,"GENERAL SHIP INFORMATION",null,null,null,"GENERAL SHIP INFORMATION",null,null,null,"GENERAL SHIP INFORMATION",null,null,null,"GENERAL SHIP INFORMATION",null,null,null,"GENERAL SHIP INFORMATION",null,null,null,"GENERAL SHIP INFORMATION",null,null,null,"GENERAL SHIP INFORMATION",null,null,null,"GENERAL SHIP INFORMATION",null,null,null,"GENERAL SHIP INFORMATION",null,null,null,"GENERAL SHIP INFORMATION",null,null,null,"GENERAL SHIP INFORMATION",null,null,null,"GENERAL SHIP INFORMATION",null,null,null,"GENERAL SHIP INFORMATION",null,null,null,"GENERAL SHIP INFORMATION",null,null,null,"GENERAL SHIP INFORMATION",null,null,null,"GENERAL SHIP INFORMATION",null,null,null,"GENERAL SHIP INFORMATION",null,null,null,"GENERAL SHIP INFORMATION",null,null,null,"GENERAL SHIP INFORMATION",null,null,null,"GENERAL SHIP INFORMATION",null,null,null,"GENERAL SHIP INFORMATION",null,null,null,"GENERAL SHIP INFORMATION",null,null,null,"GENERAL SHIP INFORMATION",null,null,null,"GENERAL SHIP INFORMATION"]
[]
[]
[null,null,null,null,null,"Vessel Particulars",null,null,null,"Vessel Particulars",null,null,null,"Vessel Particulars",null,null,null,"Vessel Particulars",null,null,null,"Vessel Particulars",null,null,null,"Vessel Particulars",null,null,null,"Vessel Particulars",null,null,null,"Vessel Particulars",null,null,null,"Vessel Particulars",null,null,null,"Vessel Particulars",null,null,null,"Vessel Particulars",null,null,null,"Vessel Particulars",null,null,null,"Vessel Particulars",null,null,null,"Vessel Particulars",null,null,null,"Vessel Particulars",null,null,null,"Vessel Particulars",null,null,null,"Vessel Particulars",null,null,null,"Vessel Particulars",null,null,null,"Vessel Particulars",null,null,null,"Vessel Particulars",null,null,null,"Vessel Particulars",null,null,null,"Vessel Particulars",null,null,null,"Vessel Particulars",null,null,null,"Vessel Particulars",null,null,null,"Vessel Particulars",null,null,null,"Vessel Particulars"]
{"$rows_left_out":180}
{"sheet":"Full Job Descriptions Standard","index":4,"n_rows":344,"n_cols":12,"rows_kept":344,"cut":false,"hidden":true,"merged":[[3,5,3,8],[18,1,18,3],[20,1,20,3],[22,1,22,3],[24,1,24,3],[14,1,14,3],[9,1,9,3],[10,1,10,3],[12,1,12,3],[23,1,23,3],[153,1,153,3],[107,1,107,3],[66,1,66,3],[97,1,97,3],[135,1,135,3],[88,1,88,3],[92,1,92,3],[104,1,104,3],[108,1,108,3],[85,1,85,3],[67,1,67,3],[70,1,70,3],[72,1,72,3],[264,1,264,3],[209,1,209,3],[208,1,208,3],[358,1,358,3],[333,1,333,3],[321,1,321,3],[320,1,320,3],[289,1,289,3],[303,1,303,3],[344,1,344,3],[285,1,285,3],[284,1,284,3],[247,1,247,3],[246,1,246,3],[243,1,243,3],[1,5,2,8],[219,1,219,3],[261,1,261,3],[180,1,180,3],[223,1,223,3],[173,1,173,3],[199,1,199,3],[94,1,94,3],[137,1,137,3],[178,1,178,3],[51,1,51,3],[96,1,96,3],[134,1,134,3],[172,1,172,3],[27,1,27,3],[28,1,28,3],[1,1,1,3],[74,1,74,3],[76,1,76,3],[79,1,79,3],[82,1,82,3],[29,1,29,3],[30,1,30,3],[33,1,33,3],[37,1,37,3],[43,1,43,3],[60,1,60,3],[62,1,62,3],[65,1,65,3],[26,1,26,3],[16,1,16,3],[7,1,7,3]]}
[]
[null,"Back to top",null,null,null,"FULL JOB DESCRIPTIONS - STANDARD"]
[]
[null,null,null,null,null,{"$f":"IF('Home Page'!H12=\"Click here to select a vessel\",\"Select a vessel and a docking type at Home Page\",'Home Page'!H12)","v":"Select a vessel and a docking type at Home Page"}]
[null,null,null,null,null,null,null,null,null,null,null,"G1000"]
[null,null,null,null,null,null,null,null,null,null,null,"H1000"]
{"$rows_left_out":339}
{"sheet":"Full Job Desc Ship Specific","index":5,"n_rows":1100,"n_cols":35,"rows_kept":1100,"cut":false,"hidden":true,"merged":[[3,5,3,8],[1,5,2,8],[29,1,29,3],[24,1,24,3],[7,1,7,3],[14,1,14,3],[12,1,12,3],[9,1,9,3],[10,1,10,3],[17,1,17,3],[18,1,18,3],[20,1,20,3],[22,1,22,3],[26,1,26,3],[27,1,27,3],[28,1,28,3],[757,1,757,3],[605,1,605,3],[641,1,641,3],[643,1,643,3],[458,1,458,3],[681,1,681,3],[687,1,687,3],[719,1,719,3],[529,1,529,3],[504,1,504,3],[733,1,733,3],[549,1,549,3],[567,1,567,3],[595,1,595,3],[947,1,947,3],[870,1,870,3],[908,1,908,3],[916,1,916,3],[778,1,778,3],[794,1,794,3],[824,1,824,3],[795,1,795,3],[832,1,832,3],[48,1,48,3],[1100,1,1100,3],[984,1,984,3],[1009,1,1009,3],[1023,1,1023,3],[1054,1,1054,3],[1060,1,1060,3],[985,1,985,3],[1098,1,1098,3],[1061,1,1061,3],[1099,1,1099,3],[946,1,946,3],[962,1,962,3],[833,1,833,3],[871,1,871,3],[909,1,909,3],[263,1,263,3],[301,1,301,3],[339,1,339,3],[46,1,46,3],[73,1,73,3],[75,1,75,3],[91,1,91,3],[113,1,113,3],[137,1,137,3],[151,1,151,3],[89,1,89,3],[132,1,132,3],[183,1,183,3],[302,1,302,3],[320,1,320,3],[47,1,47,3],[49,1,49,3],[50,1,50,3],[189,1,189,3],[227,1,227,3],[229,1,229,3],[111,1,111,3],[149,1,149,3],[187,1,187,3],[225,1,225,3],[175,1,175,3],[218,1,218,3],[377,1,377,3],[415,1,415,3],[492,1,492,3],[491,1,491,3],[264,1,264,3],[274,1,274,3],[378,1,378,3],[412,1,412,3],[416,1,416,3],[454,1,454,3],[366,1,366,3],[340,1,340,3],[453,1,453,3],[1,1,1,3],[30,1,30,3],[31,1,31,3],[36,1,36,3],[45,1,45,3]]}
[]
[null,"Back to top",null,null,null,"FULL JOB DESCRIPTIONS - SHIP SPECIFIC"]
[]
[null,null,null,null,null,{"$f":"IF('Home Page'!H12=\"Click here to select a vessel\",\"Select a vessel and a docking type at Home Page\",'Home Page'!H12)","v":"Select a vessel and a docking type at Home Page"}]
[]
[]
{"$rows_left_out":1095}
{"sheet":"Cost Comparison","index":6,"n_rows":20,"n_cols":25,"rows_kept":20,"cut":false,"hidden":true,"merged":[[2,19,2,24],[3,19,4,24],[20,1,20,3],[10,1,10,3],[12,1,12,3],[14,1,14,3],[16,1,16,3],[2,13,2,18],[3,13,4,18],[2,7,2,12],[3,7,4,12],[7,1,7,3],[1,1,1,3],[22,1,22,3],[24,1,24,3],[28,1,28,3],[42,1,42,3],[30,1,30,3],[417,1,417,3],[452,1,452,3],[487,1,487,3],[215,1,215,3],[249,1,249,3],[283,1,283,3],[314,1,314,3],[349,1,349,3],[112,1,112,3],[4,1,4,3],[147,1,147,3],[182,1,182,3],[382,1,382,3],[6,1,6,3],[5,1,5,3],[9,1,9,3],[26,1,26,3],[77,1,77,3]]}
[]
[null,"Back to top",null,null,null,null,null,null,null,null,null,"Grand Total Repair Charge",{"$f":"SUM(tblCostComp[Column7])-(SUM(tblCostComp[Column7])*CCGDiscA)","v":0},null,null,null,null,"Grand Total Repair Charge",{"$f":"SUM(tblCostComp[Column13])-(SUM(tblCostComp[Column13])*CCGDiscB)","v":0},null,null,null,null,"Grand Total Repair Charge",{"$f":"SUM(tblCostComp[Column19])-(SUM(tblCostComp[Column19])*CCGDiscC)","v":0}]
[null,null,null,null,null,null,"Select the Accepted Shipyard","A",null,null,null,null,null,"B",null,null,null,null,null,"C"]
[null,null,null,null,null,null,"Nothing selected yet","HRDD China",null,null,null,null,null,"2ND",null,null,null,null,null,"3RD"]
[]
[null,null,null,null,null,null,null,"Unit type","Unit price","Qty","Gross","Discount","Net","Unit type","Unit price","Qty","Gross","Discount","Net","Unit type","Unit price","Qty","Gross","Discount","Net"]
{"$rows_left_out":15}
{"sheet":"Selected Shipyard","index":7,"n_rows":26,"n_cols":13,"rows_kept":26,"cut":false,"hidden":true,"merged":[[417,1,417,3],[167,1,167,3],[201,1,201,3],[235,1,235,3],[244,1,244,3],[279,1,279,3],[312,1,312,3],[347,1,347,3],[382,1,382,3],[1,1,1,3],[29,1,29,3],[4,1,4,3],[7,1,7,3],[5,1,5,3],[16,1,16,3],[18,1,18,3],[22,1,22,3],[8,1,8,3],[9,1,9,3],[10,1,10,3],[12,1,12,3],[14,1,14,3],[64,1,64,3],[99,1,99,3],[134,1,134,3],[3,7,4,12],[2,7,2,12],[21,5,21,7]]}
[]
[null,"Back to top",null,null,null,null,null,"Add'l Cost",{"$f":"'Additional Jobs'!I5","v":0},null,null,"Grand Total Repair Charge",{"$f":"SYGrandTotal","v":0}]
[null,null,null,null,null,"VESSEL:",{"$f":"IF('Home Page'!H12=\"Click here to select a vessel\",\"Select a vessel at Home Page\",'Home Page'!H12)","v":"Select a vessel at Home Page"},{"$f":"Shipyard","v":"Nothing selected yet"}]
[null,null,null,null,null,null,null,{"$f":"IF(Shipyard=\"A\",'Cost Comparison'!H4,IF(Shipyard=\"B\",'Cost Comparison'!N4,IF(Shipyard=\"C\",'Cost Comparison'!T4,\"\")))","v":""}]
[]
[null,null,null,null,null,null,null,"Unit type","Unit price","Qty","Gross","Discount","Net"]
{"$rows_left_out":21}
{"sheet":"Additional Jobs","index":8,"n_rows":313,"n_cols":9,"rows_kept":313,"cut":false,"hidden":true,"merged":[[3,5,3,8],[29,1,29,3],[30,1,30,3],[7,1,7,3],[26,1,26,3],[27,1,27,3],[14,1,14,3],[18,1,18,3],[20,1,20,3],[24,1,24,3],[28,1,28,3],[12,1,12,3],[397,1,397,3],[46,1,46,3],[84,1,84,3],[122,1,122,3],[160,1,160,3],[198,1,198,3],[274,1,274,3],[359,1,359,3],[377,1,377,3],[298,1,298,3],[302,1,302,3],[310,1,310,3],[132,1,132,3],[99,1,99,3],[118,1,118,3],[1,1,1,3],[1,5,2,8],[312,1,312,3],[285,1,285,3],[262,1,262,3],[236,1,236,3],[154,1,154,3],[180,1,180,3],[120,1,120,3],[221,1,221,3],[68,1,68,3],[81,1,81,3],[9,1,9,3],[10,1,10,3],[41,1,41,3],[16,1,16,3]]}
[]
[null,"Back to top",null,null,null,"ADDITIONAL JOBS"]
[]
[null,null,null,null,null,{"$f":"IF('Home Page'!H12=\"Click here to select a vessel\",\"Select a vessel at Home Page\",'Home Page'!H12)","v":"Select a vessel at Home Page"}]
[null,null,null,null,null,null,null,"Total",{"$f":"SUM(tblAdditionalJobs[Cost])","v":0}]
[]
{"$rows_left_out":308}
{"sheet":"Project Costs","index":9,"n_rows":313,"n_cols":12,"rows_kept":313,"cut":false,"hidden":true,"merged":[[7,1,7,3],[9,1,9,3],[10,1,10,3],[12,1,12,3],[2,5,2,8],[14,1,14,3],[16,1,16,3],[18,1,18,3],[20,1,20,3],[22,1,22,3],[26,1,26,3],[27,1,27,3],[28,1,28,3],[29,1,29,3],[30,1,30,3],[41,1,41,3],[46,1,46,3],[68,1,68,3],[81,1,81,3],[180,1,180,3],[198,1,198,3],[84,1,84,3],[99,1,99,3],[118,1,118,3],[120,1,120,3],[122,1,122,3],[132,1,132,3],[154,1,154,3],[160,1,160,3],[377,1,377,3],[397,1,397,3],[274,1,274,3],[285,1,285,3],[298,1,298,3],[302,1,302,3],[310,1,310,3],[221,1,221,3],[236,1,236,3],[262,1,262,3],[312,1,312,3],[359,1,359,3]]}
[]
[]
[null,null,null,null,null,"PROJECT COSTS"]
[]
[]
[null,null,null,null,null,null,null,null,null,"Totals",{"$f":"SUM(ProjCost[Cost])","v":0},{"$f":"SUM(ProjCost[Accounts])","v":0}]
{"$rows_left_out":308}
{"sheet":"Cost of Services","index":10,"n_rows":313,"n_cols":29,"rows_kept":313,"cut":false,"hidden":true,"merged":[[2,5,2,8],[5,5,5,8],[5,10,5,15],[5,17,5,22],[5,24,5,25],[5,27,5,28],[7,1,7,3],[9,1,9,3],[10,1,10,3],[12,1,12,3],[14,1,14,3],[16,1,16,3],[18,1,18,3],[20,1,20,3],[22,1,22,3],[24,1,24,3],[27,1,27,3],[28,1,28,3],[29,1,29,3],[30,1,30,3],[41,1,41,3],[46,1,46,3],[68,1,68,3],[81,1,81,3],[84,1,84,3],[99,1,99,3],[118,1,118,3],[120,1,120,3],[122,1,122,3],[132,1,132,3],[154,1,154,3],[160,1,160,3],[180,1,180,3],[198,1,198,3],[221,1,221,3],[236,1,236,3],[262,1,262,3],[274,1,274,3],[285,1,285,3],[298,1,298,3],[397,1,397,3],[302,1,302,3],[310,1,310,3],[312,1,312,3],[359,1,359,3],[377,1,377,3]]}
[]
[]
[null,null,null,null,null,"COST OF SERVICES, SPARES, PAINTS ETC…"]
[]
[null,null,null,null,null,null,"Totals",{"$f":"SUM(tblPaints[Cost])","v":0},{"$f":"SUM(tblPaints[Accounts])","v":0},null,null,null,null,"Totals",{"$f":"SUM(tblSpareParts[Cost])","v":0},{"$f":"SUM(tblSpareParts[Accounts])","v":0},null,null,null,null,"Totals",{"$f":"SUM(tblContJCServices[Cost])","v":0},{"$f":"SUM(tblContJCServices[Accounts])","v":0},null,{"$f":"SUM(tblClass[Cost])","v":0},{"$f":"SUM(tblClass[Accounts])","v":0},null,{"$f":"SUM(tblAgency[Cost])","v":0},{"$f":"SUM(tblAgency[Accounts])","v":0}]
[null,null,null,null,null,"Paints",null,null,null,null,"Spare Parts",null,null,null,null,null,null,"Contractors/Job Cards/Services",null,null,null,null,null,null,"Class NK / ABS",null,null,"Agency Charges"]
{"$rows_left_out":308}
{"sheet":"Off-hire Bunkers","index":11,"n_rows":35,"n_cols":15,"rows_kept":35,"cut":false,"hidden":true,"merged":[[30,5,30,6],[30,13,35,14],[31,5,31,6],[32,5,32,6],[33,5,33,6],[34,7,34,8],[35,5,35,9],[34,5,34,6],[27,5,27,9],[28,5,28,6],[28,13,29,13],[28,14,29,14],[29,5,29,9],[17,5,17,14],[18,5,18,9],[18,10,35,12],[19,5,19,6],[19,13,19,14],[20,5,20,6],[20,13,20,14],[21,5,21,6],[22,5,22,6],[22,13,22,14],[23,5,23,6],[24,5,24,6],[25,5,25,6],[25,7,25,8],[25,13,26,13],[25,14,26,14],[13,12,14,12],[13,13,14,13],[13,14,14,14],[15,5,16,7],[15,12,15,14],[16,8,16,10],[16,11,16,13],[13,5,14,6],[13,7,14,7],[13,8,14,8],[13,10,14,10],[13,11,14,11],[8,5,8,14],[9,5,9,6],[10,5,10,6],[10,7,11,7],[10,8,11,8],[10,10,11,10],[10,11,11,11],[10,12,11,12],[10,13,11,13],[10,14,11,14],[11,5,11,6],[0,5,0,14],[5,5,5,6],[5,10,5,11],[5,12,5,13],[6,5,6,6],[6,10,6,11],[6,12,6,13],[2,5,2,7]]}
[null,null,null,null,null,"Bunker Consumption for Docking"]
[]
[null,null,null,null,null,"OFF-HIRE BUNKERS"]
[]
[]
[null,null,null,null,null,"LS Bunker Cost USD",null,"ULS Bunker Cost USD","LS MGO Bunker Cost USD","Av ME Cons/Day mt ","Av DA Cons/Day mt ",null,"Av BLR Con/Day mt"]
{"$rows_left_out":30}
{"sheet":"Specific Cost","index":12,"n_rows":315,"n_cols":11,"rows_kept":315,"cut":false,"hidden":true,"merged":[[13,6,13,7],[14,6,14,7],[8,6,8,7],[9,6,9,7],[10,6,10,7],[11,6,11,7],[12,6,12,7],[23,6,23,7],[24,6,24,7],[26,6,26,7],[15,6,15,7],[21,6,21,7],[22,6,22,7],[9,1,9,3],[11,1,11,3],[12,1,12,3],[14,1,14,3],[16,1,16,3],[18,1,18,3],[20,1,20,3],[22,1,22,3],[24,1,24,3],[26,1,26,3],[28,1,28,3],[29,1,29,3],[30,1,30,3],[31,1,31,3],[32,1,32,3],[43,1,43,3],[48,1,48,3],[70,1,70,3],[83,1,83,3],[86,1,86,3],[101,1,101,3],[120,1,120,3],[122,1,122,3],[124,1,124,3],[134,1,134,3],[156,1,156,3],[162,1,162,3],[182,1,182,3],[200,1,200,3],[223,1,223,3],[238,1,238,3],[264,1,264,3],[276,1,276,3],[287,1,287,3],[300,1,300,3],[399,1,399,3],[304,1,304,3],[312,1,312,3],[314,1,314,3],[361,1,361,3],[379,1,379,3]]}
[]
[]
[null,null,null,null,null,"SPECIFIC COSTS"]
[]
[null,null,null,null,null,"VESSEL :",{"$f":"IF('Home Page'!H12=\"Click here to select a vessel\",\"Select a vessel at Home Page\",'Home Page'!H12)","v":"Select a vessel at Home Page"}]
[]
{"$rows_left_out":310}
{"sheet":"Sign Off","index":13,"n_rows":315,"n_cols":13,"rows_kept":315,"cut":false,"hidden":true,"merged":[[379,1,379,3],[399,1,399,3],[287,1,287,3],[300,1,300,3],[304,1,304,3],[312,1,312,3],[314,1,314,3],[361,1,361,3],[276,1,276,3],[120,1,120,3],[122,1,122,3],[124,1,124,3],[134,1,134,3],[156,1,156,3],[162,1,162,3],[182,1,182,3],[200,1,200,3],[223,1,223,3],[238,1,238,3],[264,1,264,3],[101,1,101,3],[28,1,28,3],[29,1,29,3],[30,1,30,3],[31,1,31,3],[32,1,32,3],[43,1,43,3],[48,1,48,3],[70,1,70,3],[83,1,83,3],[86,1,86,3],[24,1,24,3],[0,6,0,10],[1,6,1,10],[9,1,9,3],[11,1,11,3],[12,1,12,3],[14,1,14,3],[16,1,16,3],[18,1,18,3],[20,1,20,3],[22,1,22,3]]}
[]
[]
[null,null,null,null,null,"SIGN OFF"]
[]
[null,null,null,null,null,"VESSEL :",{"$f":"IF('Home Page'!H12=\"Click here to select a vessel\",\"Select a vessel at Home Page\",'Home Page'!H12)","v":"Select a vessel at Home Page"},null,"DD Date:"]
[]
{"$rows_left_out":310}
{"sheet":"Accounts Summary","index":14,"n_rows":315,"n_cols":11,"rows_kept":315,"cut":false,"hidden":true,"merged":[[10,6,10,7],[314,1,314,3],[361,1,361,3],[379,1,379,3],[399,1,399,3],[304,1,304,3],[312,1,312,3],[134,1,134,3],[31,1,31,3],[32,1,32,3],[43,1,43,3],[48,1,48,3],[70,1,70,3],[83,1,83,3],[20,1,20,3],[22,1,22,3],[5,6,5,7],[4,6,4,7],[6,6,6,7],[7,6,7,7],[8,6,8,7],[9,6,9,7],[264,1,264,3],[276,1,276,3],[287,1,287,3],[300,1,300,3],[156,1,156,3],[162,1,162,3],[182,1,182,3],[200,1,200,3],[223,1,223,3],[238,1,238,3],[86,1,86,3],[101,1,101,3],[120,1,120,3],[122,1,122,3],[124,1,124,3],[24,1,24,3],[28,1,28,3],[29,1,29,3],[30,1,30,3],[9,1,9,3],[11,1,11,3],[12,1,12,3],[14,1,14,3],[16,1,16,3],[18,1,18,3]]}
[]
[]
[null,null,null,null,null,"ACCOUNTS SUMMARY"]
[]
[null,null,null,null,null,"VESSEL :",{"$f":"IF('Home Page'!H12=\"Click here to select a vessel\",\"Select a vessel at Home Page\",'Home Page'!H12)","v":"Select a vessel at Home Page"}]
[null,null,null,null,null,"Arrive HRDD","2021-02-22T00:24:00"]
{"$rows_left_out":310}
{"sheet":"SAP DL","index":15,"n_rows":316,"n_cols":18,"rows_kept":316,"cut":false,"hidden":true,"merged":[[362,1,362,3],[380,1,380,3],[400,1,400,3],[265,1,265,3],[277,1,277,3],[288,1,288,3],[301,1,301,3],[305,1,305,3],[313,1,313,3],[157,1,157,3],[163,1,163,3],[183,1,183,3],[1,1,1,3],[315,1,315,3],[239,1,239,3],[87,1,87,3],[102,1,102,3],[121,1,121,3],[123,1,123,3],[201,1,201,3],[224,1,224,3],[84,1,84,3],[21,1,21,3],[23,1,23,3],[25,1,25,3],[29,1,29,3],[30,1,30,3],[31,1,31,3],[32,1,32,3],[33,1,33,3],[44,1,44,3],[49,1,49,3],[71,1,71,3],[125,1,125,3],[135,1,135,3],[19,1,19,3],[10,1,10,3],[12,1,12,3],[13,1,13,3],[15,1,15,3],[17,1,17,3]]}
[]
[null,"Back to top"]
[null,null,null,null,null,"SAP DL"]
[]
[]
[null,null,null,null,null,null,null,null,null,null,null,null,"Total",{"$f":"tblSAP[[#Totals],[Amount in local currency]]","v":0}]
{"$rows_left_out":311}
{"sheet":"General Instructions","index":16,"n_rows":3,"n_cols":6,"rows_kept":3,"cut":false,"hidden":true,"merged":[[44,1,44,3],[48,1,48,3],[24,1,24,3],[98,1,98,3],[251,1,251,3],[62,1,62,3],[66,1,66,3],[78,1,78,3],[90,1,90,3],[96,1,96,3],[40,1,40,3],[26,1,26,3],[28,1,28,3],[2,5,2,6],[9,1,9,3],[10,1,10,3],[42,1,42,3],[20,1,20,3],[22,1,22,3],[7,1,7,3],[14,1,14,3],[16,1,16,3],[12,1,12,3],[18,1,18,3]]}
[]
[]
[null,null,null,null,null,"GENERAL INSTRUCTIONS"]

{"sheet":"VesselNameCode","index":17,"n_rows":39,"n_cols":17,"rows_kept":39,"cut":false,"hidden":true,"merged":[]}
["NAME","CODE","SIZE","VSLgsi","Infcol",null,"Select a Job classification",null,null,null,null,null,null,null,null,null,"barrel"]
["IVS BOSCH HOEK","BHK","Supramax",{"$f":"CONCATENATE(VesselNameCode[[#This Row],[CODE]],\"gsi\")","v":"BHKgsi"},"x",null,{"$f":"IF(OR('Home Page'!H16=\"2.5-yr Docking\",'Home Page'!H16=\"7.5-yr Docking\",'Home Page'!H16=\"12.5-yr Docking\"),\"tbl2.5yr7.5yr12.5yrDocking\",IF('Home Page'!H16=\"1st Special Survey (5-yr)\",\"tbl1stSpecialSurvey5yr\",IF('Home Page'!H16=\"2nd Special Survey (10-yr)\",\"tbl2ndSpecialSurvey10yr\",IF('Home Page'!H16=\"3rd Special Survey (15-yr)\",\"tbl3rdSpecialSurvey15yr\",IF('Home Page'!H16=\"Click here to select a docking type\",\"tblEmpty\",\"\")))))","v":"tblEmpty"},null,"G100.00",null,"G100.00",null,{"$f":"_xlfn._xlws.FILTER(VesselNameCode[NAME],VesselNameCode[Infcol]=\"x\")","v":"IVS BOSCH HOEK"},null,null,null,"connect"]
["Click here to select a vessel","Empty",null,{"$f":"CONCATENATE(VesselNameCode[[#This Row],[CODE]],\"gsi\")","v":"Emptygsi"},"x",null,null,null,"H100.00",null,"H100.00",null,"Click here to select a vessel",null,null,null,"day"]
["IVS GLENEAGLES","GLE","Supramax",{"$f":"CONCATENATE(VesselNameCode[[#This Row],[CODE]],\"gsi\")","v":"GLEgsi"},"x",null,null,null,"D100.00",null,"D100.00",null,"IVS GLENEAGLES",null,null,null,"day/line"]
["IVS HIRONO","HRO","Supramax",{"$f":"CONCATENATE(VesselNameCode[[#This Row],[CODE]],\"gsi\")","v":"HROgsi"},"x",null,"Select a vessel",null,"C100.00",null,"C100.00",null,"IVS HIRONO",null,null,null,"day/set"]
["IVS IBIS","IBS","Handysize",{"$f":"CONCATENATE(VesselNameCode[[#This Row],[CODE]],\"gsi\")","v":"IBSgsi"},"x",null,{"$f":"VLOOKUP(VslSelection,VesselNameCode[],4,FALSE)","v":"Emptygsi"},null,"M100.00",null,"M100.00",null,"IVS IBIS",null,null,null,"days"]
{"$rows_left_out":34}
{"sheet":"Job Desc Data Source","index":18,"n_rows":339,"n_cols":25,"rows_kept":339,"cut":false,"hidden":true,"merged":[[2,2,2,5],[1,21,1,22],[1,1,1,2],[1,6,1,7],[1,11,1,12],[1,16,1,17]]}
[]
[null,"2.5-yr/7.5-yr/12.5-yr Docking",null,null,null,null,"1st Special Survey (5-yr)",null,null,null,null,"2nd Special Survey (10-yr)",null,null,null,null,"3rd Special Survey (15-yr)",null,null,null,null,"3rd Special Survey (15-yr)"]
[]
[]
[null,"Item No","Description","Cost","Remarks",null,"Item No","Description","Cost","Remarks",null,"Item No","Description","Cost","Remarks",null,"Item No","Description","Cost","Remarks",null,"Item No","Description","Cost","Remarks"]
[null,"G100.00","GENERAL SERVICES 2.5-yr Docking",null,null,null,"G100.00","GENERAL SERVICES 5-yr Docking",null,null,null,"G100.00","GENERAL SERVICES 10-yr Docking",null,null,null,"G100.00","GENERAL SERVICES 15-yr Docking",null,null,null,null,"Select a docking type at Home Page"]
{"$rows_left_out":333}